BDBM50062200 CHEMBL2371144::FVPTDVG-Hop-FAF
SMILES CC(C)[C@H](NC(=O)[C@H](CC(O)=O)NC(=O)[C@@H](NC(=O)[C@@H]1CCCN1C(=O)[C@@H](NC(=O)[C@@H](N)Cc1ccccc1)C(C)C)[C@@H](C)O)C(=O)NCC(=O)N1CCCC[C@H]1C(=O)N[C@@H](Cc1ccccc1)C(=O)N[C@@H](C)C(=O)N[C@@H](Cc1ccccc1)C(O)=O
InChI Key InChIKey=QVMIIQSWXSFKSZ-DGTNFBTQSA-N
Data  1 IC50
  Tab Delimited (TSV)   2D SDfile   Computed 3D by Vconf -m prep SDfile
Find this compound or compounds like it in BindingDB:
Activity Spreadsheet -- Enzyme Inhibition Constant Data from BindingDB
Found 1 hit for monomerid = 50062200
TargetCalcitonin gene-related peptide type 1 receptor(Homo sapiens (Human))
Eth ZüRich
Curated by ChEMBL
LigandPNGBDBM50062200(CHEMBL2371144 | FVPTDVG-Hop-FAF)
Affinity DataIC50:  910nM. Assay description: CGRP1 receptor affinity on human neuroblastoma cells SK-N-MC, which selectively express the human CGRP1 receptor.
In DepthDetails ArticlePubMed