BDBM50063120 (6R,7S)-6,7,8,8-Tetramethyl-4-trifluoromethyl-6,7,8,9-tetrahydro-1H-pyrido[3,2-g]quinolin-2-one::CHEMBL156641
SMILES C[C@@H]1[C@H](C)C(C)(C)Nc2cc3[nH]c(=O)cc(c3cc12)C(F)(F)F
InChI Key InChIKey=PDXCFTVMFXAKMC-BDAKNGLRSA-N
Data  1 KI  2 IC50
  Tab Delimited (TSV)   2D SDfile   Computed 3D by Vconf -m prep SDfile
Find this compound or compounds like it in BindingDB:
Activity Spreadsheet -- Enzyme Inhibition Constant Data from BindingDB
Found 3 hits for monomerid = 50063120
TargetAndrogen receptor(Homo sapiens (Human))
Ligand Pharmaceuticals
Curated by ChEMBL
LigandPNGBDBM50063120((6R,7S)-6,7,8,8-Tetramethyl-4-trifluoromethyl-6,7,...)
Affinity DataKi:  456nM. Assay description: Binding affinity for human androgen receptor in transiently-transfected COS-1 cells.
In DepthDetails ArticlePubMed
TargetAndrogen receptor(Homo sapiens (Human))
Ligand Pharmaceuticals
Curated by ChEMBL
LigandPNGBDBM50063120((6R,7S)-6,7,8,8-Tetramethyl-4-trifluoromethyl-6,7,...)
Affinity DataIC50:  164nM. Assay description: Antagonistic activity against human androgen receptor (hAR) in co-transfected CV-1 cells.
In DepthDetails ArticlePubMed
TargetProgesterone receptor(Homo sapiens (Human))
Ligand Pharmaceuticals
Curated by ChEMBL
LigandPNGBDBM50063120((6R,7S)-6,7,8,8-Tetramethyl-4-trifluoromethyl-6,7,...)
Affinity DataIC50:  310nM. Assay description: Antagonistic activity against human progesterone receptor B (hPR-B) in co-transfected CV-1 cells.
In DepthDetails ArticlePubMed