BDBM50064569 CHEMBL61117::{3-[4-(3-Chloro-phenyl)-piperazin-1-ylmethyl]-phenyl}-piperidin-1-yl-methanone
SMILES Clc1cccc(c1)N1CCN(Cc2cccc(c2)C(=O)N2CCCCC2)CC1
InChI Key InChIKey=YKIZYXJHWPXPDB-UHFFFAOYSA-N
Data  2 KI
  Tab Delimited (TSV)   2D SDfile   Computed 3D by Vconf -m prep SDfile
Find this compound or compounds like it in BindingDB:
Activity Spreadsheet -- Enzyme Inhibition Constant Data from BindingDB
Found 2 hits for monomerid = 50064569
Target5-hydroxytryptamine receptor 1A(Rattus norvegicus (rat))
R. W. Johnson Pharmaceutical Research Institute
Curated by ChEMBL
LigandPNGBDBM50064569(CHEMBL61117 | {3-[4-(3-Chloro-phenyl)-piperazin-1-...)
Affinity DataKi:  1.20nM. Assay description: Compound was evaluated for its binding affinity against 5-hydroxytryptamine 1A receptor from rat cerebral cortex
In DepthDetails ArticlePubMed
TargetD(2) dopamine receptor(Rattus norvegicus (rat))
R. W. Johnson Pharmaceutical Research Institute
Curated by ChEMBL
LigandPNGBDBM50064569(CHEMBL61117 | {3-[4-(3-Chloro-phenyl)-piperazin-1-...)
Affinity DataKi:  347nM. Assay description: Binding affinity against Dopamine receptor D2 from rat striatum
In DepthDetails ArticlePubMed