BDBM50064736 1-(1-{5-Fluoro-2-methoxy-4-[1-((S)-1-oxy-5,6,7,8-tetrahydro-quinolin-5-yl)-piperidin-4-yloxy]-benzoyl}-piperidin-4-yl)-1,4-dihydro-benzo[d][1,3]oxazin-2-one::CHEMBL68800
SMILES COc1cc(OC2CCN(CC2)[C@H]2CCCc3c2ccc[n+]3[O-])c(F)cc1C(=O)N1CCC(CC1)N1C(=O)OCc2ccccc12
InChI Key InChIKey=XMCRJVIWAZBDSM-PMERELPUSA-N
Data  2 KI
  Tab Delimited (TSV)   2D SDfile   Computed 3D by Vconf -m prep SDfile
Find this compound or compounds like it in BindingDB:
Activity Spreadsheet -- Enzyme Inhibition Constant Data from BindingDB
Found 2 hits for monomerid = 50064736
TargetOxytocin receptor(Homo sapiens (Human))
Merck Research Laboratories
Curated by ChEMBL
LigandPNGBDBM50064736(1-(1-{5-Fluoro-2-methoxy-4-[1-((S)-1-oxy-5,6,7,8-t...)
Affinity DataKi:  1.70nM. Assay description: Binding affinity for cloned human oxytocin receptor (OT-R)
In DepthDetails ArticlePubMed
TargetOxytocin receptor(RAT)
Merck Research Laboratories
Curated by ChEMBL
LigandPNGBDBM50064736(1-(1-{5-Fluoro-2-methoxy-4-[1-((S)-1-oxy-5,6,7,8-t...)
Affinity DataKi:  8.5nM. Assay description: Binding affinity for rat oxytocin receptor (OT-R)
In DepthDetails ArticlePubMed