BDBM50067102 3-Chloro-N-(3-pyridin-2-yl-isoquinolin-1-yl)-benzamide::3-chloro-N-(3-(pyridin-2-yl)isoquinolin-1-yl)benzamide::CHEMBL128538::TCMDC-123886
SMILES Clc1cccc(c1)C(=O)Nc1nc(cc2ccccc12)-c1ccccn1
InChI Key InChIKey=YSHJTCFCQHGIAC-UHFFFAOYSA-N
Data  2 KI
  Tab Delimited (TSV)   2D SDfile   Computed 3D by Vconf -m prep SDfile
Find this compound or compounds like it in BindingDB:
Activity Spreadsheet -- Enzyme Inhibition Constant Data from BindingDB
Found 2 hits for monomerid = 50067102
TargetAdenosine receptor A3(Homo sapiens (Human))
Università
Curated by ChEMBL
LigandPNGBDBM50067102(3-Chloro-N-(3-pyridin-2-yl-isoquinolin-1-yl)-benza...)
Affinity DataKi:  770nM. Assay description: Displacement of [3H]MRE 3008F20 from human adenosine A3 receptor expressed in CHO cells
In DepthDetails ArticlePubMed
TargetAdenosine receptor A3(Homo sapiens (Human))
Università
Curated by ChEMBL
LigandPNGBDBM50067102(3-Chloro-N-(3-pyridin-2-yl-isoquinolin-1-yl)-benza...)
Affinity DataKi:  7.70E+5nM. Assay description: Tested for antagonist activity by displacement of specific [125I]-AB-MECA binding at human Adenosine A3 receptor expressed in HEK 293 cells.
In DepthDetails ArticlePubMed