BDBM50067744 1-Cycloheptyl-1-[4-(4-fluoro-phenoxy)-benzyl]-3-(2,4,6-trimethyl-phenyl)-urea::CHEMBL139220::FR-179254
SMILES Cc1cc(C)c(NC(=O)N(Cc2ccc(Oc3ccc(F)cc3)cc2)C2CCCCCC2)c(C)c1
InChI Key InChIKey=XGSPYZRAWSMUHY-UHFFFAOYSA-N
Data  1 IC50
  Tab Delimited (TSV)   2D SDfile   Computed 3D by Vconf -m prep SDfile
Find this compound or compounds like it in BindingDB:
Activity Spreadsheet -- Enzyme Inhibition Constant Data from BindingDB
Found 1 hit for monomerid = 50067744
TargetAcyl-CoA:cholesterol acyltransferase(Oryctolagus cuniculus)
Fujisawa Pharmaceutical
Curated by ChEMBL
LigandPNGBDBM50067744(1-Cycloheptyl-1-[4-(4-fluoro-phenoxy)-benzyl]-3-(2...)
Affinity DataIC50:  25nM. Assay description: In vitro inhibition of acyl coenzyme A:cholesterol acyltransferase (ACAT) from rabbit intestinal microsomes
In DepthDetails ArticlePubMed