BDBM50068110 CHEMBL3402234
SMILES Cn1ccc(CNCCc2ccccc2)n1
InChI Key InChIKey=KFUQJDBRNAORPV-UHFFFAOYSA-N
Data  1 IC50
PDB links: 1 PDB ID matches this monomer.
  Tab Delimited (TSV)   2D SDfile   Computed 3D by Vconf -m prep SDfile
Find this compound or compounds like it in BindingDB:
Activity Spreadsheet -- Enzyme Inhibition Constant Data from BindingDB
Found 1 hit for monomerid = 50068110
TargetBifunctional epoxide hydrolase 2(Homo sapiens (Human))
Astellas Pharma
Curated by ChEMBL
LigandPNGBDBM50068110(CHEMBL3402234)
Affinity DataIC50:  8.00E+5nM. Assay description: Inhibition of C-terminal His6-tagged full-length human soluble epoxide hydrolase expressed in Escherichia coli BL21(DE3) cells pre-incubated for 15 m...