BDBM50068895 1-(4-{[(S)-1-((S)-2-tert-Butoxycarbonylamino-3-methyl-butyryl)-pyrrolidine-2-carbonyl]-amino}-2,2-difluoro-3-oxo-5-phenyl-pentanoyl)-pyrrolidine-2-carboxylic acid::CHEMBL368262
SMILES CC(C)[C@H](NC(=O)OC(C)(C)C)C(=O)N1CCC[C@H]1C(=O)NC(Cc1ccccc1)C(=O)C(F)(F)C(=O)N1CCCC1C(O)=O
InChI Key InChIKey=IAVPOQNSQQEGQF-ZWDXQAFOSA-N
Data  2 KI
  Tab Delimited (TSV)   2D SDfile   Computed 3D by Vconf -m prep SDfile
Find this compound or compounds like it in BindingDB:
Activity Spreadsheet -- Enzyme Inhibition Constant Data from BindingDB
Found 2 hits for monomerid = 50068895
TargetChymase(Homo sapiens (Human))
Green Cross Research Laboratories
Curated by ChEMBL
LigandPNGBDBM50068895(1-(4-{[(S)-1-((S)-2-tert-Butoxycarbonylamino-3-met...)
Affinity DataKi:  493nM. Assay description: Compound was evaluated for inhibitory activity against human heart chymase (HHC)
In DepthDetails ArticlePubMed
TargetChymotrypsinogen A(Bos taurus (bovine))
Green Cross Research Laboratories
Curated by ChEMBL
LigandPNGBDBM50068895(1-(4-{[(S)-1-((S)-2-tert-Butoxycarbonylamino-3-met...)
Affinity DataKi: >1.00E+5nM. Assay description: Compound was evaluated for inhibitory activity against Chymotrypsinogen
In DepthDetails ArticlePubMed