BDBM50068997 CHEMBL3403465
SMILES CCOc1cc(OC(C)C)c(F)c(c1)C(Nc1ccc(cc1)C(N)=N)c1nc2ccccc2[nH]1
InChI Key InChIKey=JCIKZZOKNQEHHF-UHFFFAOYSA-N
Data  1 KI
  Tab Delimited (TSV)   2D SDfile   Computed 3D by Vconf -m prep SDfile
Find this compound or compounds like it in BindingDB:
Activity Spreadsheet -- Enzyme Inhibition Constant Data from BindingDB
Found 1 hit for monomerid = 50068997
TargetCoagulation factor VII(Homo sapiens (Human))
Bristol-Myers Squibb R & D
Curated by ChEMBL
LigandPNGBDBM50068997(CHEMBL3403465)
Affinity DataKi:  140nM. Assay description: Inhibition of human factor 7a using H-D-Ile-Pro-Arg-pNA substrate
In DepthDetails ArticlePubMed