BDBM50069886 (2,6-Diisopropyl-phenylcarbamoyl)-methanesulfonic acid 2,4,6-triisopropyl-phenyl ester::CHEMBL322919
SMILES CC(C)c1cc(C(C)C)c(OS(=O)(=O)CC(=O)Nc2c(cccc2C(C)C)C(C)C)c(c1)C(C)C
InChI Key InChIKey=URRQSLHODKGACS-UHFFFAOYSA-N
Data  1 IC50
  Tab Delimited (TSV)   2D SDfile   Computed 3D by Vconf -m prep SDfile
Find this compound or compounds like it in BindingDB:
Activity Spreadsheet -- Enzyme Inhibition Constant Data from BindingDB
Found 1 hit for monomerid = 50069886
TargetAcyl-CoA:cholesterol acyltransferase(Oryctolagus cuniculus)
Warner-Lambert
Curated by ChEMBL
LigandPNGBDBM50069886((2,6-Diisopropyl-phenylcarbamoyl)-methanesulfonic ...)
Affinity DataIC50:  7nM. Assay description: In vitro inhibition of ACAT by incubation with [1-14C]-oleolyl-CoA and intestinal microsomes isolated from cholesterol-fed rabbits.
In DepthDetails ArticlePubMed