BDBM50070300 2N-[3-(1-{2-[3-(5-cyano-2-pyridylsulfonamido)phenyl]-2-ethyl-4-hydroxy-6-oxo-3,6-dihydro-2H-5-pyranyl}propyl)phenyl]-5-cyano-2-pyridinesulfonamide::CHEMBL22121
SMILES CCC(C1C(=O)CC(CC)(OC1=O)c1cccc(NS(=O)(=O)c2ccc(cn2)C#N)c1)c1cccc(NS(=O)(=O)c2ccc(cn2)C#N)c1
InChI Key InChIKey=LGJJYMCHXCSUKT-UHFFFAOYSA-N
Data  1 KI
  Tab Delimited (TSV)   2D SDfile   Computed 3D by Vconf -m prep SDfile
Find this compound or compounds like it in BindingDB:
Activity Spreadsheet -- Enzyme Inhibition Constant Data from BindingDB
Found 1 hit for monomerid = 50070300
TargetGag-Pol polyprotein [489-587](Human immunodeficiency virus type 1)
Pharmacia & Upjohn
Curated by ChEMBL
LigandPNGBDBM50070300(2N-[3-(1-{2-[3-(5-cyano-2-pyridylsulfonamido)pheny...)
Affinity DataKi:  0.100nM. Assay description: Compound was evaluated for in vitro inhibition of human immunodeficiency virus type 1 (HIV-1) Protease
In DepthDetails ArticlePubMed