BDBM50070826 CHEMBL46331::N-(6-Amino-2-methyl-pyridin-3-ylmethyl)-2-(2-oxo-3-phenylmethanesulfonylamino-6-trifluoromethyl-2H-pyridin-1-yl)-acetamide
SMILES Cc1nc(N)ccc1CNC(=O)Cn1c(ccc(NS(=O)(=O)Cc2ccccc2)c1=O)C(F)(F)F
InChI Key InChIKey=OGKPBVRUWGDXTB-UHFFFAOYSA-N
Data  2 KI
  Tab Delimited (TSV)   2D SDfile   Computed 3D by Vconf -m prep SDfile
Find this compound or compounds like it in BindingDB:
Activity Spreadsheet -- Enzyme Inhibition Constant Data from BindingDB
Found 2 hits for monomerid = 50070826
TargetProthrombin(Homo sapiens (Human))
Merck Research Laboratories
Curated by ChEMBL
LigandPNGBDBM50070826(CHEMBL46331 | N-(6-Amino-2-methyl-pyridin-3-ylmeth...)
Affinity DataKi:  12nM. Assay description: Compound was evaluated to inhibit the thrombin enzyme
In DepthDetails ArticlePubMed
TargetSerine protease 1(Homo sapiens (Human))
Merck Research Laboratories
Curated by ChEMBL
LigandPNGBDBM50070826(CHEMBL46331 | N-(6-Amino-2-methyl-pyridin-3-ylmeth...)
Affinity DataKi:  2.50E+3nM. Assay description: Compound was evaluated to inhibit the trypsin enzyme
In DepthDetails ArticlePubMed