BDBM50071557 3-Hydroxy-6-methyl-4-{(S)-4-methyl-2-[2-(naphthalen-2-yloxy)-acetylamino]-pentanoylamino}-heptanoic acid butylamide::CHEMBL77282
SMILES CCCCNC(=O)CC(O)C(CC(C)C)NC(=O)[C@H](CC(C)C)NC(=O)COc1ccc2ccccc2c1
InChI Key InChIKey=KZPLDAGPIVXPII-QLLQDVQFSA-N
Data  2 KI
  Tab Delimited (TSV)   2D SDfile   Computed 3D by Vconf -m prep SDfile
Find this compound or compounds like it in BindingDB:
Activity Spreadsheet -- Enzyme Inhibition Constant Data from BindingDB
Found 2 hits for monomerid = 50071557
TargetCathepsin D(Homo sapiens (Human))
Pharmacopeia
Curated by ChEMBL
LigandPNGBDBM50071557(3-Hydroxy-6-methyl-4-{(S)-4-methyl-2-[2-(naphthale...)
Affinity DataKi:  920nM. Assay description: Inhibitory activity against cathepsin D
In DepthDetails ArticlePubMed
TargetPlasmepsin II(Plasmodium falciparum)
Pharmacopeia
Curated by ChEMBL
LigandPNGBDBM50071557(3-Hydroxy-6-methyl-4-{(S)-4-methyl-2-[2-(naphthale...)
Affinity DataKi:  5.60E+3nM. Assay description: In vitro inhibition of plasmepsin-2 from Plasmodium falciparum.
In DepthDetails ArticlePubMed