BDBM50072364 1-{1-[2-Methoxy-4-((R)-1-pyridin-4-yl-ethoxy)-benzoyl]-piperidin-4-yl}-1,4-dihydro-benzo[d][1,3]oxazin-2-one::CHEMBL322187
SMILES COc1cc(O[C@H](C)c2ccncc2)ccc1C(=O)N1CCC(CC1)N1C(=O)OCc2ccccc12
InChI Key InChIKey=RBQFEXQGZPKVGQ-LJQANCHMSA-N
Data  1 KI
  Tab Delimited (TSV)   2D SDfile   Computed 3D by Vconf -m prep SDfile
Find this compound or compounds like it in BindingDB:
Activity Spreadsheet -- Enzyme Inhibition Constant Data from BindingDB
Found 1 hit for monomerid = 50072364
TargetOxytocin receptor(Homo sapiens (Human))
Merck Research Laboratories
Curated by ChEMBL
LigandPNGBDBM50072364(1-{1-[2-Methoxy-4-((R)-1-pyridin-4-yl-ethoxy)-benz...)
Affinity DataKi:  3.90nM. Assay description: Binding affinity against cloned human oxytocin receptor from human embryonic kidney cells
In DepthDetails ArticlePubMed