BDBM50072518 (6S,8aS)-6-[4-Guanidino-1-(thiazole-2-carbonyl)-butylcarbamoyl]-4-oxo-hexahydro-pyrrolo[1,2-a]pyrazine-2-carboxylic acid benzyl ester::CHEMBL322307
SMILES NC(=N)NCCCC(NC(=O)[C@@H]1CC[C@H]2CN(CC(=O)N12)C(=O)OCc1ccccc1)C(=O)c1nccs1
InChI Key InChIKey=BNLHSTXGBMVOTB-JVUMBYKBSA-N
Data  1 KI
  Tab Delimited (TSV)   2D SDfile   Computed 3D by Vconf -m prep SDfile
Find this compound or compounds like it in BindingDB:
Activity Spreadsheet -- Enzyme Inhibition Constant Data from BindingDB
Found 1 hit for monomerid = 50072518
TargetProthrombin(Homo sapiens (Human))
Biochem Therapeutic
Curated by ChEMBL
LigandPNGBDBM50072518((6S,8aS)-6-[4-Guanidino-1-(thiazole-2-carbonyl)-bu...)
Affinity DataKi:  50nM. Assay description: Binding affinity of the compound against thrombin
In DepthDetails ArticlePubMed