BDBM50072521 (6S,8aS)-4-Oxo-2-(2-phenoxy-acetyl)-octahydro-pyrrolo[1,2-a]pyrazine-6-carboxylic acid [4-guanidino-1-(thiazole-2-carbonyl)-butyl]-amide::CHEMBL321167
SMILES NC(=N)NCCCC(NC(=O)[C@@H]1CC[C@H]2CN(CC(=O)N12)C(=O)COc1ccccc1)C(=O)c1nccs1
InChI Key InChIKey=IKQMHFZHDASAJP-NMBLWERJSA-N
Data  1 KI
  Tab Delimited (TSV)   2D SDfile   Computed 3D by Vconf -m prep SDfile
Find this compound or compounds like it in BindingDB:
Activity Spreadsheet -- Enzyme Inhibition Constant Data from BindingDB
Found 1 hit for monomerid = 50072521
TargetProthrombin(Homo sapiens (Human))
Biochem Therapeutic
Curated by ChEMBL
LigandPNGBDBM50072521((6S,8aS)-4-Oxo-2-(2-phenoxy-acetyl)-octahydro-pyrr...)
Affinity DataKi:  16nM. Assay description: Binding affinity of the compound against thrombin
In DepthDetails ArticlePubMed