BDBM50072587 (2R,3S,4R,5S,6R)-6-Mercaptomethyl-tetrahydro-pyran-2,3,4,5-tetraol::CHEMBL323902
SMILES O[C@@H]1O[C@@H](CS)[C@@H](O)[C@@H](O)[C@@H]1O
InChI Key InChIKey=OMLRWUJGVBOYQP-SXUWKVJYSA-N
Data  1 KI
  Tab Delimited (TSV)   2D SDfile   Computed 3D by Vconf -m prep SDfile
Find this compound or compounds like it in BindingDB:
Activity Spreadsheet -- Enzyme Inhibition Constant Data from BindingDB
Found 1 hit for monomerid = 50072587
TargetTissue alpha-L-fucosidase(Homo sapiens (Human))
University Of Connecticut
Curated by ChEMBL
LigandPNGBDBM50072587((2R,3S,4R,5S,6R)-6-Mercaptomethyl-tetrahydro-pyran...)
Affinity DataKi:  4.20E+4nM. Assay description: Inhibitory activity of the compound was determined against alpha-L-fucosidase in bovine kidney; Competitive Inhibition type
In DepthDetails ArticlePubMed