BDBM50073755 4-[6-(3-Chloro-phenylamino)-9-ethyl-9H-purin-2-ylamino]-cyclohexanol::CHEMBL177057
SMILES CCn1cnc2c(Nc3cccc(Cl)c3)nc(N[C@@H]3CC[C@H](O)CC3)nc12
InChI Key InChIKey=YUCMWAUBTFDJIZ-OTVXOJSOSA-N
Data  1 IC50
  Tab Delimited (TSV)   2D SDfile   Computed 3D by Vconf -m prep SDfile
Find this compound or compounds like it in BindingDB:
Activity Spreadsheet -- Enzyme Inhibition Constant Data from BindingDB
Found 1 hit for monomerid = 50073755
TargetCyclin-dependent kinase 1(Homo sapiens (Human))
Novartis Pharmaceuticals
Curated by ChEMBL
LigandPNGBDBM50073755(4-[6-(3-Chloro-phenylamino)-9-ethyl-9H-purin-2-yla...)
Affinity DataIC50:  30nM. Assay description: Inhibition of Cyclin-dependent kinase 1, CDK1-related human bladder carcinoma (T24) cell protliferation
In DepthDetails ArticlePubMed