BDBM50075807 1-(3-{1-[2-(4-Iodo-phenyl)-ethyl]-piperidin-4-yl}-propyl)-2-phenoxymethyl-4-(3-piperidin-1-yl-propoxy)-1H-benzoimidazole::CHEMBL349328
SMILES Ic1ccc(CCN2CCC(CCCn3c(COc4ccccc4)nc4c(OCCCN5CCCCC5)cccc34)CC2)cc1
InChI Key InChIKey=AKUPTCFWDTYGOJ-UHFFFAOYSA-N
Data  1 KI
  Tab Delimited (TSV)   2D SDfile   Computed 3D by Vconf -m prep SDfile
Find this compound or compounds like it in BindingDB:
Activity Spreadsheet -- Enzyme Inhibition Constant Data from BindingDB
Found 1 hit for monomerid = 50075807
TargetNeuropeptide Y receptor type 1(Homo sapiens (Human))
Eli Lilly
Curated by ChEMBL
LigandPNGBDBM50075807(1-(3-{1-[2-(4-Iodo-phenyl)-ethyl]-piperidin-4-yl}-...)
Affinity DataKi:  0.0520nM. Assay description: Ability to displace [125I]-peptide YY binding to cloned human Neuropeptide Y receptor type 1 expressed in AV-12 cells
In DepthDetails ArticlePubMed