BDBM50076299 CHEMBL3416323
SMILES [O-][N+](=O)c1ccc(Sc2cccc(Cl)c2)c2nonc12
InChI Key InChIKey=RWTVQJMHWQOGAT-UHFFFAOYSA-N
Data  3 IC50
  Tab Delimited (TSV)   2D SDfile   Computed 3D by Vconf -m prep SDfile
Find this compound or compounds like it in BindingDB:
Activity Spreadsheet -- Enzyme Inhibition Constant Data from BindingDB
Found 3 hits for monomerid = 50076299
TargetHistone acetyltransferase GCN5(Saccharomyces cerevisiae S288c)
Mayo Clinic
Curated by ChEMBL
LigandPNGBDBM50076299(CHEMBL3416323)
Affinity DataIC50:  2.30E+3nM. Assay description: Inhibition of Vps75-stimulated recombinant Saccharomyces cerevisiae histone acetyltransferase Rtt109 using Asf1-dH3-H4 as substrate assessed as coenz...
In DepthDetails ArticlePubMed
TargetIndoleamine 2,3-dioxygenase 1(Homo sapiens (Human))
University Of Auckland
Curated by ChEMBL
LigandPNGBDBM50076299(CHEMBL3416323)
Affinity DataIC50:  1.20E+4nM. Assay description: Inhibition of recombinant human IDO1 expressed in bacterial expression system using L-Tryptophan as substrate after 25 mins in absence of GSH and pre...
In DepthDetails ArticlePubMed
TargetHistone acetyltransferase GCN5(Saccharomyces cerevisiae S288c)
Mayo Clinic
Curated by ChEMBL
LigandPNGBDBM50076299(CHEMBL3416323)
Affinity DataIC50:  6.90E+3nM. Assay description: Inhibition of Vps75-stimulated recombinant Saccharomyces cerevisiae histone acetyltransferase Rtt109 using Asf1-dH3-H4 as substrate assessed as coenz...
In DepthDetails ArticlePubMed