BDBM50077094 6-Ethyl-1,9-dimethyl-4-trifluoromethyl-6,7,8,9-tetrahydro-1H-pyrido[3,2-g]quinolin-2-one::CHEMBL27413
SMILES CCC1CCN(C)c2cc3n(C)c(=O)cc(c3cc12)C(F)(F)F
InChI Key InChIKey=FHGKNGNEOJWOJZ-UHFFFAOYSA-N
Data  1 KI  1 IC50  1 EC50
  Tab Delimited (TSV)   2D SDfile   Computed 3D by Vconf -m prep SDfile
Find this compound or compounds like it in BindingDB:
Activity Spreadsheet -- Enzyme Inhibition Constant Data from BindingDB
Found 3 hits for monomerid = 50077094
TargetAndrogen receptor(Homo sapiens (Human))
Ligand Pharmaceuticals
Curated by ChEMBL
LigandPNGBDBM50077094(6-Ethyl-1,9-dimethyl-4-trifluoromethyl-6,7,8,9-tet...)
Affinity DataKi:  263nM. Assay description: Antagonistic activity against human androgen receptor (hAR) in CV-1 cells was determined as a function of maximal inhibition of dihydrotestosterone u...
In DepthDetails ArticlePubMed
TargetAndrogen receptor(Homo sapiens (Human))
Ligand Pharmaceuticals
Curated by ChEMBL
LigandPNGBDBM50077094(6-Ethyl-1,9-dimethyl-4-trifluoromethyl-6,7,8,9-tet...)
Affinity DataEC50: >1.00E+4nM. Assay description: Binding affinity to the human androgen receptor (hAR), using [3H]DHT as radioligand in a competitive binding assay
In DepthDetails ArticlePubMed
TargetAndrogen receptor(Homo sapiens (Human))
Ligand Pharmaceuticals
Curated by ChEMBL
LigandPNGBDBM50077094(6-Ethyl-1,9-dimethyl-4-trifluoromethyl-6,7,8,9-tet...)
Affinity DataIC50:  216nM. Assay description: Antagonistic activity against human androgen receptor (hAR) in CV-1 cells using cotransfection assay
In DepthDetails ArticlePubMed