BDBM50078309 4-(3,3-Diphenyl-propylamino)-cinnoline-3-carbonitrile::CHEMBL42312
SMILES N#Cc1nnc2ccccc2c1NCCC(c1ccccc1)c1ccccc1
InChI Key InChIKey=OKYZTEUAKHHRRB-UHFFFAOYSA-N
Data  1 KI
PDB links: 1 PDB ID matches this monomer.
  Tab Delimited (TSV)   2D SDfile   Computed 3D by Vconf -m prep SDfile
Find this compound or compounds like it in BindingDB:
Activity Spreadsheet -- Enzyme Inhibition Constant Data from BindingDB
Found 1 hit for monomerid = 50078309
TargetScytalone dehydratase(Magnaporthe grisea)
Fmc Stine Research Center
Curated by ChEMBL
LigandPNGBDBM50078309(4-(3,3-Diphenyl-propylamino)-cinnoline-3-carbonitr...)
Affinity DataKi:  0.00800nM. Assay description: Inhibition of scytalone dehydratase purified from Magnaporthe grisea