BDBM50078448 3-{[3-Oxo-2-(2-piperidin-4-yl-ethyl)-2,3-dihydro-1H-isoindole-5-carbonyl]-amino}-propionic acid::3-{[3-Oxo-2-(2-piperidin-4-yl-ethyl)-2,3-dihydro-1H-isoindole-5-carbonyl]-amino}-propionic acid(L-709780)::CHEMBL32960::L-709780
SMILES OC(=O)CCNC(=O)c1ccc2CN(CCC3CCNCC3)C(=O)c2c1
InChI Key InChIKey=YAAYYZAARZCUQN-UHFFFAOYSA-N
Data  6 IC50  5 Kd
  Tab Delimited (TSV)   2D SDfile   Computed 3D by Vconf -m prep SDfile
Find this compound or compounds like it in BindingDB:
Activity Spreadsheet -- Enzyme Inhibition Constant Data from BindingDB
Found 11 hits for monomerid = 50078448
TargetIntegrin alpha-IIb/beta-3(Homo sapiens (Human))
Merck Research Laboratories
Curated by ChEMBL
LigandPNGBDBM50078448(3-{[3-Oxo-2-(2-piperidin-4-yl-ethyl)-2,3-dihydro-1...)
Affinity DataKd:  550nM. Assay description: Equilibrium dissociation constant was measured from displacement of L-762,745 from Fibrinogen receptor of human platelets by flow cytometry
In DepthDetails ArticlePubMed
TargetIntegrin alpha-IIb/beta-3(Homo sapiens (Human))
Merck Research Laboratories
Curated by ChEMBL
LigandPNGBDBM50078448(3-{[3-Oxo-2-(2-piperidin-4-yl-ethyl)-2,3-dihydro-1...)
Affinity DataIC50:  27nM. Assay description: The compound was tested in vivo for the inhibition of aggregation of human gel-filtered platelets(GFP)
In DepthDetails ArticlePubMed
TargetIntegrin alpha-2/beta-3(Homo sapiens (Human))
A.V. Bogatsky Physico-Chemical Institute Of The National Academy Of Sciences Of Ukraine
Curated by ChEMBL
LigandPNGBDBM50078448(3-{[3-Oxo-2-(2-piperidin-4-yl-ethyl)-2,3-dihydro-1...)
Affinity DataIC50:  25nM. Assay description: Antagonist activity at integrin alpha2beta3-mediated aggregation in ADP-stimulated human platelets
In DepthDetails ArticlePubMed
TargetIntegrin alpha-IIb/beta-3(Homo sapiens (Human))
Merck Research Laboratories
Curated by ChEMBL
LigandPNGBDBM50078448(3-{[3-Oxo-2-(2-piperidin-4-yl-ethyl)-2,3-dihydro-1...)
Affinity DataKd:  550nM. Assay description: Dissociation constant for alpha IIb beta-3 integrin rested platelets
In DepthDetails ArticlePubMed
TargetIntegrin alpha-IIb/beta-3(Homo sapiens (Human))
Merck Research Laboratories
Curated by ChEMBL
LigandPNGBDBM50078448(3-{[3-Oxo-2-(2-piperidin-4-yl-ethyl)-2,3-dihydro-1...)
Affinity DataIC50:  25nM. Assay description: In vitro inhibition of gel filtered platelet aggregation induced by ADP.
In DepthDetails ArticlePubMed
TargetIntegrin alpha-IIb/beta-3(Homo sapiens (Human))
Merck Research Laboratories
Curated by ChEMBL
LigandPNGBDBM50078448(3-{[3-Oxo-2-(2-piperidin-4-yl-ethyl)-2,3-dihydro-1...)
Affinity DataIC50:  2.50E+4nM. Assay description: Inhibition of 10 uM ADP-induced human gel filtered platelet aggregation with 0.1 mg/mL human fibrinogen
In DepthDetails Article
TargetIntegrin alpha-IIb/beta-3(Homo sapiens (Human))
Merck Research Laboratories
Curated by ChEMBL
LigandPNGBDBM50078448(3-{[3-Oxo-2-(2-piperidin-4-yl-ethyl)-2,3-dihydro-1...)
Affinity DataKd:  13nM. Assay description: Binding affinity to resting form of alpha IIb/beta3 integrin by flow cytometry using fluorescein ligand L-726,745 displacement from human platelets.
In DepthDetails ArticlePubMed
TargetIntegrin alpha-IIb/beta-3(Homo sapiens (Human))
Merck Research Laboratories
Curated by ChEMBL
LigandPNGBDBM50078448(3-{[3-Oxo-2-(2-piperidin-4-yl-ethyl)-2,3-dihydro-1...)
Affinity DataIC50:  27nM. Assay description: Inhibition of aggregation of human gel-filtered platelets measured by light transmittance method at 37 degrees C.
In DepthDetails ArticlePubMed
TargetIntegrin alpha-IIb/beta-3(Homo sapiens (Human))
Merck Research Laboratories
Curated by ChEMBL
LigandPNGBDBM50078448(3-{[3-Oxo-2-(2-piperidin-4-yl-ethyl)-2,3-dihydro-1...)
Affinity DataKd:  100nM. Assay description: Binding affinity against alpha IIb beta3 integrin in the presence of L-736622.
In DepthDetails Article
TargetIntegrin alpha-IIb/beta-3(Homo sapiens (Human))
Merck Research Laboratories
Curated by ChEMBL
LigandPNGBDBM50078448(3-{[3-Oxo-2-(2-piperidin-4-yl-ethyl)-2,3-dihydro-1...)
Affinity DataIC50:  25nM. Assay description: Inhibition of ADP-mediated platelet aggregation in human gel-filtered platelets
In DepthDetails Article
TargetIntegrin alpha-IIb/beta-3(Homo sapiens (Human))
Merck Research Laboratories
Curated by ChEMBL
LigandPNGBDBM50078448(3-{[3-Oxo-2-(2-piperidin-4-yl-ethyl)-2,3-dihydro-1...)
Affinity DataKd:  120nM. Assay description: Competition with [1251]L-692,884 for binding to purified alpha IIb/beta3 integrin, activated by coating onto yttrium silicate scintillation proximity...
In DepthDetails ArticlePubMed