BDBM50079059 6-(2-Sulfamoyl-benzothiazol-6-yloxycarbamoyl)-pyridine-2-carboxylic acid::CHEMBL313925
SMILES NS(=O)(=O)c1nc2ccc(ONC(=O)c3cccc(n3)C(O)=O)cc2s1
InChI Key InChIKey=HGDPEBXABBBXAU-UHFFFAOYSA-N
Data  3 KI
  Tab Delimited (TSV)   2D SDfile   Computed 3D by Vconf -m prep SDfile
Find this compound or compounds like it in BindingDB:
Activity Spreadsheet -- Enzyme Inhibition Constant Data from BindingDB
Found 3 hits for monomerid = 50079059
TargetCarbonic anhydrase 2(Homo sapiens (Human))
Universit£
Curated by ChEMBL
LigandPNGBDBM50079059(6-(2-Sulfamoyl-benzothiazol-6-yloxycarbamoyl)-pyri...)
Affinity DataKi:  2nM. Assay description: Inhibitory activity against human recombinant carbonic anhydrase II
In DepthDetails ArticlePubMed
TargetCarbonic anhydrase 4(Bos taurus (bovine))
Universit£
Curated by ChEMBL
LigandPNGBDBM50079059(6-(2-Sulfamoyl-benzothiazol-6-yloxycarbamoyl)-pyri...)
Affinity DataKi:  13nM. Assay description: Inhibitory activity against bovine lung microsomes carbonic anhydrase isozyme IV (bCA IV).
In DepthDetails ArticlePubMed
TargetCarbonic anhydrase 1(Homo sapiens (Human))
Universit£
Curated by ChEMBL
LigandPNGBDBM50079059(6-(2-Sulfamoyl-benzothiazol-6-yloxycarbamoyl)-pyri...)
Affinity DataKi:  16nM. Assay description: Inhibitory activity against human cloned carbonic anhydrase isozyme I (hCA I, cytosolic form).
In DepthDetails ArticlePubMed