BDBM50080869 CHEMBL1236450
SMILES [O-][N+](=O)c1ccccc1C(=O)NCc1cc(Br)cc(Br)c1OC(=O)c1ccccc1Cl
InChI Key InChIKey=WKUUVOPOQKZMFY-UHFFFAOYSA-N
Data  1 EC50
PDB links: 1 PDB ID matches this monomer.
  Tab Delimited (TSV)   2D SDfile   Computed 3D by Vconf -m prep SDfile
Find this compound or compounds like it in BindingDB:
Activity Spreadsheet -- Enzyme Inhibition Constant Data from BindingDB
Found 1 hit for monomerid = 50080869
TargetTranscriptional activator protein LasR(Pseudomonas aeruginosa)
Rowan University
Curated by ChEMBL
LigandPNGBDBM50080869(CHEMBL1236450)
Affinity DataEC50:  28nM. Assay description: Agonist activity at Pseudomonas aeruginosa LasR