BDBM50081353 4-(4-Aminomethyl-6,7-dimethoxy-1-oxo-1H-isoquinolin-2-yl)-butyric acid ethyl ester::CHEMBL126945
SMILES CCOC(=O)CCCn1cc(CN)c2cc(OC)c(OC)cc2c1=O
InChI Key InChIKey=GYBCBOHESZEEPM-UHFFFAOYSA-N
Data  1 IC50
  Tab Delimited (TSV)   2D SDfile   Computed 3D by Vconf -m prep SDfile
Find this compound or compounds like it in BindingDB:
Activity Spreadsheet -- Enzyme Inhibition Constant Data from BindingDB
Found 1 hit for monomerid = 50081353
TargetTumor necrosis factor(Homo sapiens (Human))
University Of California
Curated by ChEMBL
LigandPNGBDBM50081353(4-(4-Aminomethyl-6,7-dimethoxy-1-oxo-1H-isoquinoli...)
Affinity DataIC50:  1.30E+4nM. Assay description: The compound was tested in vitro for inhibitory activity against Tumor necrosis factor alpha from human PMBC cell line by ELISA test.
In DepthDetails ArticlePubMed