BDBM50081365 3-(5-{3-[(Z)-amino(imino)methyl]phenoxy}-2,4-difluoro-3-methylphenoxy)benzenecarboximidamide::CHEMBL126575
SMILES Cc1c(F)c(Oc2cccc(c2)C(N)=N)cc(Oc2cccc(c2)C(N)=N)c1F
InChI Key InChIKey=AMIWNBPSEQZDCD-UHFFFAOYSA-N
Data  2 KI
  Tab Delimited (TSV)   2D SDfile   Computed 3D by Vconf -m prep SDfile
Find this compound or compounds like it in BindingDB:
Activity Spreadsheet -- Enzyme Inhibition Constant Data from BindingDB
Found 2 hits for monomerid = 50081365
TargetCoagulation factor X(Homo sapiens (Human))
Washington University
Curated by ChEMBL
LigandPNGBDBM50081365(3-(5-{3-[(Z)-amino(imino)methyl]phenoxy}-2,4-diflu...)
Affinity DataKi:  12nM. Assay description: Inhibitory constant of the compound against Coagulation factor Xa (factor Xa)
In DepthDetails ArticlePubMed
TargetSerine protease 1(Bos taurus (bovine))
Washington University
Curated by ChEMBL
LigandPNGBDBM50081365(3-(5-{3-[(Z)-amino(imino)methyl]phenoxy}-2,4-diflu...)
Affinity DataKi:  740nM. Assay description: Inhibitory constant of the compound against trypsin
In DepthDetails ArticlePubMed