BDBM50082158 2-[4-(4-Hydroxymethyl-benzoyl)-benzyl]-5-methyl-thieno[2,3-d][1,3]oxazin-4-one::CHEMBL107357
SMILES Cc1csc2nc(Cc3ccc(cc3)C(=O)c3ccc(CO)cc3)oc(=O)c12
InChI Key InChIKey=BIFXILGAVVXNFT-UHFFFAOYSA-N
Data  1 IC50
  Tab Delimited (TSV)   2D SDfile   Computed 3D by Vconf -m prep SDfile
Find this compound or compounds like it in BindingDB:
Activity Spreadsheet -- Enzyme Inhibition Constant Data from BindingDB
Found 1 hit for monomerid = 50082158
TargetCapsid scaffolding protein(Human cytomegalovirus (strain AD169) (HHV-5) (Huma...)
Smithkline Beecham Pharmaceuticals
Curated by ChEMBL
LigandPNGBDBM50082158(2-[4-(4-Hydroxymethyl-benzoyl)-benzyl]-5-methyl-th...)
Affinity DataIC50:  940nM. Assay description: Inhibitory activity against Human Cytomegalovirus (hCMV) protease
In DepthDetails ArticlePubMed