BDBM50083082 (1R,2R)-1-Phenyl-1-{1-[3-(5-[1,2,4]triazol-4-yl-1H-indol-3-yl)-propyl]-piperidin-4-ylamino}-propan-2-ol::CHEMBL143947
SMILES C[C@@H](O)[C@H](NC1CCN(CCCc2c[nH]c3ccc(cc23)-n2cnnc2)CC1)c1ccccc1
InChI Key InChIKey=AMZZHMUOOCFWEG-HRFSGMKKSA-N
Data  2 IC50  1 EC50
  Tab Delimited (TSV)   2D SDfile   Computed 3D by Vconf -m prep SDfile
Find this compound or compounds like it in BindingDB:
Activity Spreadsheet -- Enzyme Inhibition Constant Data from BindingDB
Found 3 hits for monomerid = 50083082
Target5-hydroxytryptamine receptor 1D(Homo sapiens (Human))
Merck Sharp & Dohme Research Laboratories
Curated by ChEMBL
LigandPNGBDBM50083082((1R,2R)-1-Phenyl-1-{1-[3-(5-[1,2,4]triazol-4-yl-1H...)
Affinity DataIC50:  0.900nM. Assay description: Displacement of [3H]-5-HT binding to cloned human 5-hydroxytryptamine 1D receptor stably expressed in CHO cells
In DepthDetails ArticlePubMed
Target5-hydroxytryptamine receptor 1B(Homo sapiens (Human))
Merck Sharp & Dohme Research Laboratories
Curated by ChEMBL
LigandPNGBDBM50083082((1R,2R)-1-Phenyl-1-{1-[3-(5-[1,2,4]triazol-4-yl-1H...)
Affinity DataIC50:  48nM. Assay description: Displacement of [3H]-5-HT binding to cloned 5-hydroxytryptamine 1B receptor stably expressed in CHO cells
In DepthDetails ArticlePubMed
Target5-hydroxytryptamine receptor 1D(Homo sapiens (Human))
Merck Sharp & Dohme Research Laboratories
Curated by ChEMBL
LigandPNGBDBM50083082((1R,2R)-1-Phenyl-1-{1-[3-(5-[1,2,4]triazol-4-yl-1H...)
Affinity DataEC50:  1nM. Assay description: Agonist-induced [35S]- GTPgammaS binding in CHO cells stably transfected with 5-hydroxytryptamine 1D receptor
In DepthDetails ArticlePubMed