BDBM50083091 CHEMBL357634::N-Methyl-N-{1-[3-(5-[1,2,4]triazol-4-yl-1H-indol-3-yl)-propyl]-piperidin-4-yl}-benzenesulfonamide
SMILES CN(C1CCN(CCCc2c[nH]c3ccc(cc23)-n2cnnc2)CC1)S(=O)(=O)c1ccccc1
InChI Key InChIKey=IFTFRKXQTPMNTF-UHFFFAOYSA-N
Data  2 IC50
  Tab Delimited (TSV)   2D SDfile   Computed 3D by Vconf -m prep SDfile
Find this compound or compounds like it in BindingDB:
Activity Spreadsheet -- Enzyme Inhibition Constant Data from BindingDB
Found 2 hits for monomerid = 50083091
Target5-hydroxytryptamine receptor 1B(Homo sapiens (Human))
Merck Sharp & Dohme Research Laboratories
Curated by ChEMBL
LigandPNGBDBM50083091(CHEMBL357634 | N-Methyl-N-{1-[3-(5-[1,2,4]triazol-...)
Affinity DataIC50:  10nM. Assay description: Displacement of [3H]-5-HT binding to cloned 5-hydroxytryptamine 1B receptor stably expressed in CHO cells
In DepthDetails ArticlePubMed
Target5-hydroxytryptamine receptor 1D(Homo sapiens (Human))
Merck Sharp & Dohme Research Laboratories
Curated by ChEMBL
LigandPNGBDBM50083091(CHEMBL357634 | N-Methyl-N-{1-[3-(5-[1,2,4]triazol-...)
Affinity DataIC50:  1.5nM. Assay description: Displacement of [3H]-5-HT binding to cloned human 5-hydroxytryptamine 1D receptor stably expressed in CHO cells
In DepthDetails ArticlePubMed