BDBM50083135 ((S)-1-Phenyl-ethyl)-{1-[3-(5-[1,2,4]triazol-4-yl-1H-indol-3-yl)-propyl]-piperidin-4-ylmethyl}-amine::CHEMBL146391
SMILES C[C@H](NCC1CCN(CCCc2c[nH]c3ccc(cc23)-n2cnnc2)CC1)c1ccccc1
InChI Key InChIKey=XHZKWSOQRLGCRE-NRFANRHFSA-N
Data  2 IC50
  Tab Delimited (TSV)   2D SDfile   Computed 3D by Vconf -m prep SDfile
Find this compound or compounds like it in BindingDB:
Activity Spreadsheet -- Enzyme Inhibition Constant Data from BindingDB
Found 2 hits for monomerid = 50083135
Target5-hydroxytryptamine receptor 1D(Homo sapiens (Human))
Merck Sharp & Dohme Research Laboratories
Curated by ChEMBL
LigandPNGBDBM50083135(((S)-1-Phenyl-ethyl)-{1-[3-(5-[1,2,4]triazol-4-yl-...)
Affinity DataIC50:  4.40nM. Assay description: Displacement of [3H]-5-HT binding to cloned human 5-hydroxytryptamine 1D receptor stably expressed in CHO cells
In DepthDetails ArticlePubMed
Target5-hydroxytryptamine receptor 1B(Homo sapiens (Human))
Merck Sharp & Dohme Research Laboratories
Curated by ChEMBL
LigandPNGBDBM50083135(((S)-1-Phenyl-ethyl)-{1-[3-(5-[1,2,4]triazol-4-yl-...)
Affinity DataIC50:  58nM. Assay description: Displacement of [3H]-5-HT binding to cloned 5-hydroxytryptamine 1B receptor stably expressed in CHO cells
In DepthDetails ArticlePubMed