BDBM50083389 1-{[1-(1-Carboxy-2-sulfo-ethylcarbamoyl)-2-methyl-butylcarbamoyl]-mercapto-methyl}-3-sulfo-propyl-ammonium::CHEMBL436269
SMILES CC[C@@H](C)[C@H](NC(=O)[C@@H](S)[C@H]([NH3+])CCS([O-])(=O)=O)C(=O)N[C@@H](CS(O)(=O)=O)C(O)=O
InChI Key InChIKey=YBXYPMVTWBRFAI-UVOCVTCTSA-N
Data  2 KI
  Tab Delimited (TSV)   2D SDfile   Computed 3D by Vconf -m prep SDfile
Find this compound or compounds like it in BindingDB:
Activity Spreadsheet -- Enzyme Inhibition Constant Data from BindingDB
Found 2 hits for monomerid = 50083389
TargetGlutamyl aminopeptidase(Homo sapiens (Human))
University Of Paris
Curated by ChEMBL
LigandPNGBDBM50083389(1-{[1-(1-Carboxy-2-sulfo-ethylcarbamoyl)-2-methyl-...)
Affinity DataKi:  83nM. Assay description: Binding affinity against recombinant Aminopeptidase A
In DepthDetails ArticlePubMed
TargetAminopeptidase N(Sus scrofa (Pig))
University Of Paris
Curated by ChEMBL
LigandPNGBDBM50083389(1-{[1-(1-Carboxy-2-sulfo-ethylcarbamoyl)-2-methyl-...)
Affinity DataKi: >5.00E+3nM. Assay description: Binding affinity against aminopeptidase N from pig kidney
In DepthDetails ArticlePubMed