BDBM50084011 CHEMBL2372436::N-((S)-1-{[(1-Formyl-4-guanidino-butylcarbamoyl)-methyl]-carbamoyl}-4-guanidino-butyl)-succinamic acid
SMILES NC(=N)NCCC[C@H](NC(=O)CNC(=O)[C@@H](CCCNC(N)=N)NC(=O)CCC(O)=O)C=O
InChI Key InChIKey=SWQONBMWTIHHBM-NWDGAFQWSA-N
Data  2 IC50
  Tab Delimited (TSV)   2D SDfile   Computed 3D by Vconf -m prep SDfile
Find this compound or compounds like it in BindingDB:
Activity Spreadsheet -- Enzyme Inhibition Constant Data from BindingDB
Found 2 hits for monomerid = 50084011
TargetCoagulation factor X(Homo sapiens (Human))
Cor Therapeutics
Curated by ChEMBL
LigandPNGBDBM50084011(CHEMBL2372436 | N-((S)-1-{[(1-Formyl-4-guanidino-b...)
Affinity DataIC50:  224nM. Assay description: Inhibitory activity against coagulation factor X.
In DepthDetails ArticlePubMed
TargetProthrombin(Homo sapiens (Human))
Cor Therapeutics
Curated by ChEMBL
LigandPNGBDBM50084011(CHEMBL2372436 | N-((S)-1-{[(1-Formyl-4-guanidino-b...)
Affinity DataIC50: >1.00E+5nM. Assay description: Inhibitory activity against coagulation factor II (thrombin).
In DepthDetails ArticlePubMed