BDBM50084069 Benzenesulfonic acid 3-(1-carbamimidoyl-piperidin-4-ylmethoxy)-5-methyl-phenyl ester::CHEMBL424394
SMILES Cc1cc(OCC2CCN(CC2)C(N)=N)cc(OS(=O)(=O)c2ccccc2)c1
InChI Key InChIKey=MVUIVBYIEQEQFL-UHFFFAOYSA-N
Data  1 KI
  Tab Delimited (TSV)   2D SDfile   Computed 3D by Vconf -m prep SDfile
Find this compound or compounds like it in BindingDB:
Activity Spreadsheet -- Enzyme Inhibition Constant Data from BindingDB
Found 1 hit for monomerid = 50084069
TargetProthrombin(Homo sapiens (Human))
3-Dimensional Pharmaceuticals
Curated by ChEMBL
LigandPNGBDBM50084069(Benzenesulfonic acid 3-(1-carbamimidoyl-piperidin-...)
Affinity DataKi:  32nM. Assay description: Anti- Thrombin activity using standard chromogenic assay
In DepthDetails ArticlePubMed