BDBM50085331 (4-Ethynyl-cyclohex-3-enyl)-dipropyl-amine::4-ethynyl-N,N-dipropylcyclohex-3-enamine::CHEMBL162762
SMILES CCCN(CCC)C1CCC(=CC1)C#C
InChI Key InChIKey=IOUKEEFTYOZOKJ-UHFFFAOYSA-N
Data  27 KI  2 EC50
  Tab Delimited (TSV)   2D SDfile   Computed 3D by Vconf -m prep SDfile
Find this compound or compounds like it in BindingDB:
Activity Spreadsheet -- Enzyme Inhibition Constant Data from BindingDB
Found 29 hits for monomerid = 50085331
TargetD(3) dopamine receptor(Homo sapiens (Human))
Friedrich-Alexander University
Curated by ChEMBL
LigandPNGBDBM50085331((4-Ethynyl-cyclohex-3-enyl)-dipropyl-amine | 4-eth...)
Affinity DataKi:  5.20nM. Assay description: Binding Affinity was tested on the high affinity site of Dopamine receptor D3
In DepthDetails ArticlePubMed
TargetD(2) dopamine receptor(BOVINE)
Friedrich-Alexander University
Curated by ChEMBL
LigandPNGBDBM50085331((4-Ethynyl-cyclohex-3-enyl)-dipropyl-amine | 4-eth...)
Affinity DataKi:  15nM. Assay description: Binding Affinity was tested on high Affinity Site of Bovine dopamine receptor D2. Tested for ability to displace the radioligand [3H]pramipexole
In DepthDetails ArticlePubMed
TargetD(4) dopamine receptor(Homo sapiens (Human))
Friedrich-Alexander University
Curated by ChEMBL
LigandPNGBDBM50085331((4-Ethynyl-cyclohex-3-enyl)-dipropyl-amine | 4-eth...)
Affinity DataKi:  22nM. Assay description: Binding Affinity was tested on the high affinity site of Dopamine receptor D4.4
In DepthDetails ArticlePubMed
TargetD(3) dopamine receptor(Homo sapiens (Human))
Friedrich-Alexander University
Curated by ChEMBL
LigandPNGBDBM50085331((4-Ethynyl-cyclohex-3-enyl)-dipropyl-amine | 4-eth...)
Affinity DataKi:  23nM. Assay description: Binding Affinity was tested on relative proportion of High Affinity Site of Dopamine receptor D3
In DepthDetails ArticlePubMed
TargetD(2) dopamine receptor(Homo sapiens (Human))
Friedrich-Alexander University
Curated by ChEMBL
LigandPNGBDBM50085331((4-Ethynyl-cyclohex-3-enyl)-dipropyl-amine | 4-eth...)
Affinity DataKi:  34nM. Assay description: Binding Affinity was tested on relative proportion of High Affinity Site of Dopamine receptor D2S
In DepthDetails ArticlePubMed
TargetD(2) dopamine receptor(Homo sapiens (Human))
Friedrich-Alexander University
Curated by ChEMBL
LigandPNGBDBM50085331((4-Ethynyl-cyclohex-3-enyl)-dipropyl-amine | 4-eth...)
Affinity DataKi:  38nM. Assay description: Binding Affinity was tested on relative proportion of High Affinity Site of Dopamine receptor D2L
In DepthDetails ArticlePubMed
TargetD(4) dopamine receptor(Homo sapiens (Human))
Friedrich-Alexander University
Curated by ChEMBL
LigandPNGBDBM50085331((4-Ethynyl-cyclohex-3-enyl)-dipropyl-amine | 4-eth...)
Affinity DataKi:  38nM. Assay description: Binding Affinity was tested on relative proportion of High Affinity Site of Dopamine receptor D4.4
In DepthDetails ArticlePubMed
TargetD(2) dopamine receptor(BOVINE)
Friedrich-Alexander University
Curated by ChEMBL
LigandPNGBDBM50085331((4-Ethynyl-cyclohex-3-enyl)-dipropyl-amine | 4-eth...)
Affinity DataKi:  40nM. Assay description: Binding Affinity was tested on relative proportion of high Affinity Site of Bovine dopamine receptor D2. Tested for ability to displace the radioliga...
In DepthDetails ArticlePubMed
TargetD(2) dopamine receptor(BOVINE)
Friedrich-Alexander University
Curated by ChEMBL
LigandPNGBDBM50085331((4-Ethynyl-cyclohex-3-enyl)-dipropyl-amine | 4-eth...)
Affinity DataKi:  57nM. Assay description: Binding Affinity was tested on high Affinity Site of Bovine Dopamine D2 Receptor. Tested for ability to displace the radioligand [3H]-Spiperone
In DepthDetails ArticlePubMed
TargetD(4) dopamine receptor(Homo sapiens (Human))
Friedrich-Alexander University
Curated by ChEMBL
LigandPNGBDBM50085331((4-Ethynyl-cyclohex-3-enyl)-dipropyl-amine | 4-eth...)
Affinity DataKi:  170nM. Assay description: Dissociation constant of compound on one-site model Dopamine receptor D4.4
In DepthDetails ArticlePubMed
TargetD(3) dopamine receptor(Homo sapiens (Human))
Friedrich-Alexander University
Curated by ChEMBL
LigandPNGBDBM50085331((4-Ethynyl-cyclohex-3-enyl)-dipropyl-amine | 4-eth...)
Affinity DataKi:  190nM. Assay description: Displacement of [3H]spiperone from human wild type D3 receptor expressed in human HEK293 cells
In DepthDetails ArticlePubMed
TargetD(2) dopamine receptor(Homo sapiens (Human))
Friedrich-Alexander University
Curated by ChEMBL
LigandPNGBDBM50085331((4-Ethynyl-cyclohex-3-enyl)-dipropyl-amine | 4-eth...)
Affinity DataKi:  250nM. Assay description: Binding Affinity on High Affinity Site of Dopamine receptor D2S
In DepthDetails ArticlePubMed
TargetD(2) dopamine receptor(Homo sapiens (Human))
Friedrich-Alexander University
Curated by ChEMBL
LigandPNGBDBM50085331((4-Ethynyl-cyclohex-3-enyl)-dipropyl-amine | 4-eth...)
Affinity DataKi:  270nM. Assay description: Binding affinity on High Affinity Site of Dopamine receptor D2L
In DepthDetails ArticlePubMed
TargetD(3) dopamine receptor(Homo sapiens (Human))
Friedrich-Alexander University
Curated by ChEMBL
LigandPNGBDBM50085331((4-Ethynyl-cyclohex-3-enyl)-dipropyl-amine | 4-eth...)
Affinity DataKi:  350nM. Assay description: Dissociation constant of compound on one-site model Human Dopamine receptor D3
In DepthDetails ArticlePubMed
TargetD(4) dopamine receptor(Homo sapiens (Human))
Friedrich-Alexander University
Curated by ChEMBL
LigandPNGBDBM50085331((4-Ethynyl-cyclohex-3-enyl)-dipropyl-amine | 4-eth...)
Affinity DataKi:  380nM. Assay description: Binding Affinity was tested on low Affinity Site of Dopamine receptor D4.4
In DepthDetails ArticlePubMed
TargetD(3) dopamine receptor(Homo sapiens (Human))
Friedrich-Alexander University
Curated by ChEMBL
LigandPNGBDBM50085331((4-Ethynyl-cyclohex-3-enyl)-dipropyl-amine | 4-eth...)
Affinity DataKi:  590nM. Assay description: Binding Affinity was tested on low Affinity Site of Dopamine receptor D3
In DepthDetails ArticlePubMed
TargetD(3) dopamine receptor(Homo sapiens (Human))
Friedrich-Alexander University
Curated by ChEMBL
LigandPNGBDBM50085331((4-Ethynyl-cyclohex-3-enyl)-dipropyl-amine | 4-eth...)
Affinity DataKi:  720nM. Assay description: Binding Affinity was determined in the presence of 100 micro M Gpp(NH)p for decoupling of the ternary complex of Compound to Dopamine receptor D3
In DepthDetails ArticlePubMed
TargetD(1A) dopamine receptor(BOVINE)
Friedrich-Alexander University
Curated by ChEMBL
LigandPNGBDBM50085331((4-Ethynyl-cyclohex-3-enyl)-dipropyl-amine | 4-eth...)
Affinity DataKi:  750nM. Assay description: Dissociation constant of compound on one-site model Bovine dopamine receptor D2. Tested for ability to displace the radioligand [3H]spiperone at the ...
In DepthDetails ArticlePubMed
TargetD(2) dopamine receptor(Homo sapiens (Human))
Friedrich-Alexander University
Curated by ChEMBL
LigandPNGBDBM50085331((4-Ethynyl-cyclohex-3-enyl)-dipropyl-amine | 4-eth...)
Affinity DataKi:  2.80E+3nM. Assay description: Dissociation constant of compound on one-site model Dopamine receptor D2L
In DepthDetails ArticlePubMed
TargetD(2) dopamine receptor(Homo sapiens (Human))
Friedrich-Alexander University
Curated by ChEMBL
LigandPNGBDBM50085331((4-Ethynyl-cyclohex-3-enyl)-dipropyl-amine | 4-eth...)
Affinity DataKi:  2.90E+3nM. Assay description: Dissociation constant of compound on one-site model Dopamine receptor D2S
In DepthDetails ArticlePubMed
TargetD(2) dopamine receptor(BOVINE)
Friedrich-Alexander University
Curated by ChEMBL
LigandPNGBDBM50085331((4-Ethynyl-cyclohex-3-enyl)-dipropyl-amine | 4-eth...)
Affinity DataKi:  4.10E+3nM. Assay description: Binding Affinity was tested on low Affinity Site of Bovine dopamine receptor D2. Tested for ability to displace the radioligand [3H]spiperone at the ...
In DepthDetails ArticlePubMed
TargetD(2) dopamine receptor(Homo sapiens (Human))
Friedrich-Alexander University
Curated by ChEMBL
LigandPNGBDBM50085331((4-Ethynyl-cyclohex-3-enyl)-dipropyl-amine | 4-eth...)
Affinity DataKi:  1.20E+4nM. Assay description: Binding Affinity of Compound of Dopamine receptor D2S
In DepthDetails ArticlePubMed
TargetD(2) dopamine receptor(Homo sapiens (Human))
Friedrich-Alexander University
Curated by ChEMBL
LigandPNGBDBM50085331((4-Ethynyl-cyclohex-3-enyl)-dipropyl-amine | 4-eth...)
Affinity DataKi:  1.40E+4nM. Assay description: Binding Affinity was tested on low Affinity Site of Dopamine receptor D2L
In DepthDetails ArticlePubMed
TargetD(1A) dopamine receptor(BOVINE)
Friedrich-Alexander University
Curated by ChEMBL
LigandPNGBDBM50085331((4-Ethynyl-cyclohex-3-enyl)-dipropyl-amine | 4-eth...)
Affinity DataKi:  1.70E+4nM. Assay description: Binding Affinity was determined for decoupling of the ternary complex of Compound to Bovine dopamine receptor D1. Tested for ability to displace the ...
In DepthDetails ArticlePubMed
TargetD(2) dopamine receptor(Homo sapiens (Human))
Friedrich-Alexander University
Curated by ChEMBL
LigandPNGBDBM50085331((4-Ethynyl-cyclohex-3-enyl)-dipropyl-amine | 4-eth...)
Affinity DataKi:  1.70E+4nM. Assay description: Binding Affinity was determined in the presence of 100 micro M Gpp(NH)p for decoupling of the ternary complex of Compound to Dopamine receptor D2S
In DepthDetails ArticlePubMed
TargetD(2) dopamine receptor(Homo sapiens (Human))
Friedrich-Alexander University
Curated by ChEMBL
LigandPNGBDBM50085331((4-Ethynyl-cyclohex-3-enyl)-dipropyl-amine | 4-eth...)
Affinity DataKi:  1.90E+4nM. Assay description: Binding Affinity was determined in the presence of 100 micro M Gpp(NH)p for decoupling of the ternary complex of Compound to Dopamine receptor D2L
In DepthDetails ArticlePubMed
TargetD(1A) dopamine receptor(BOVINE)
Friedrich-Alexander University
Curated by ChEMBL
LigandPNGBDBM50085331((4-Ethynyl-cyclohex-3-enyl)-dipropyl-amine | 4-eth...)
Affinity DataKi: >2.00E+4nM. Assay description: Binding Affinity was tested on High Affinity Site of Bovine dopamine receptor D1. Tested for ability to displace the radioligand [3H]-SCH- 23390
In DepthDetails ArticlePubMed
TargetD(3) dopamine receptor(Homo sapiens (Human))
Friedrich-Alexander University
Curated by ChEMBL
LigandPNGBDBM50085331((4-Ethynyl-cyclohex-3-enyl)-dipropyl-amine | 4-eth...)
Affinity DataEC50:  7.70nM. Assay description: Intrinsic activity at human D3 receptor expressed in CHO dhfr- cells assessed as inhibition of forskolin-induced cAMP release
In DepthDetails ArticlePubMed
TargetD(3) dopamine receptor(Homo sapiens (Human))
Friedrich-Alexander University
Curated by ChEMBL
LigandPNGBDBM50085331((4-Ethynyl-cyclohex-3-enyl)-dipropyl-amine | 4-eth...)
Affinity DataEC50:  4.40nM. Assay description: Intrinsic activity at human D3 receptor expressed in CHO dhfr- cells by [3H]thymidine incorporation assay
In DepthDetails ArticlePubMed