BDBM50085661 (2R,3R,4S,5R)-2-[6-Amino-2-((1R,2R)-2-hydroxy-cyclopentylamino)-purin-9-yl]-5-hydroxymethyl-tetrahydro-furan-3,4-diol::CHEMBL334336
SMILES Nc1nc(N[C@@H]2CCC[C@H]2O)nc2n(cnc12)[C@@H]1O[C@H](CO)[C@@H](O)[C@H]1O
InChI Key InChIKey=PXPWOYNKXVZDHY-SMKPNTNISA-N
Data  2 KI
  Tab Delimited (TSV)   2D SDfile   Computed 3D by Vconf -m prep SDfile
Find this compound or compounds like it in BindingDB:
Activity Spreadsheet -- Enzyme Inhibition Constant Data from BindingDB
Found 2 hits for monomerid = 50085661
TargetAdenosine receptor A2a(Homo sapiens (Human))
Glaxowellcome Medicines Research Centre
Curated by ChEMBL
LigandPNGBDBM50085661((2R,3R,4S,5R)-2-[6-Amino-2-((1R,2R)-2-hydroxy-cycl...)
Affinity DataKi:  0.800nM. Assay description: In vitro inhibition of human neutrophil activation via Adenosine A2A receptor.
In DepthDetails ArticlePubMed
TargetAdenosine receptor A1(GUINEA PIG)
Glaxowellcome Medicines Research Centre
Curated by ChEMBL
LigandPNGBDBM50085661((2R,3R,4S,5R)-2-[6-Amino-2-((1R,2R)-2-hydroxy-cycl...)
Affinity DataKi:  1.47E+3nM. Assay description: Ex vivo inhibition of guinea pig ileum twitch via Adenosine A1 receptor.
In DepthDetails ArticlePubMed