BDBM50085673 (2R,3R,4S,5R)-2-[2-Cyclopentylamino-6-(2,2-diphenyl-ethylamino)-purin-9-yl]-5-hydroxymethyl-tetrahydro-furan-3,4-diol::CHEMBL131175
SMILES OC[C@H]1O[C@H]([C@H](O)[C@@H]1O)n1cnc2c(NCC(c3ccccc3)c3ccccc3)nc(NC3CCCC3)nc12
InChI Key InChIKey=BEWLOOLKMOTCKY-ZYWWQZICSA-N
Data  2 KI
  Tab Delimited (TSV)   2D SDfile   Computed 3D by Vconf -m prep SDfile
Find this compound or compounds like it in BindingDB:
Activity Spreadsheet -- Enzyme Inhibition Constant Data from BindingDB
Found 2 hits for monomerid = 50085673
TargetAdenosine receptor A2a(Homo sapiens (Human))
Glaxowellcome Medicines Research Centre
Curated by ChEMBL
LigandPNGBDBM50085673((2R,3R,4S,5R)-2-[2-Cyclopentylamino-6-(2,2-dipheny...)
Affinity DataKi:  36nM. Assay description: In vitro inhibition of human neutrophil activation via Adenosine A2A receptor.
In DepthDetails ArticlePubMed
TargetAdenosine receptor A1(GUINEA PIG)
Glaxowellcome Medicines Research Centre
Curated by ChEMBL
LigandPNGBDBM50085673((2R,3R,4S,5R)-2-[2-Cyclopentylamino-6-(2,2-dipheny...)
Affinity DataKi: >612nM. Assay description: Ex vivo inhibition of guinea pig ileum twitch via Adenosine A1 receptor.
In DepthDetails ArticlePubMed