BDBM50085834 CHEMBL172691::[5-(Benzo[1,3]dioxol-4-ylmethoxy)-2-cyano-phenoxy]-o-tolyl-acetic acid
SMILES Cc1ccccc1C(Oc1cc(OCc2cccc3OCOc23)ccc1C#N)C(O)=O
InChI Key InChIKey=UXUCGIHLCOKEBF-UHFFFAOYSA-N
Data  1 IC50
  Tab Delimited (TSV)   2D SDfile   Computed 3D by Vconf -m prep SDfile
Find this compound or compounds like it in BindingDB:
Activity Spreadsheet -- Enzyme Inhibition Constant Data from BindingDB
Found 1 hit for monomerid = 50085834
TargetEndothelin-1 receptor(RAT)
RhôNe-Poulenc Rorer
Curated by ChEMBL
LigandPNGBDBM50085834(CHEMBL172691 | [5-(Benzo[1,3]dioxol-4-ylmethoxy)-2...)
Affinity DataIC50:  3.00E+3nM. Assay description: In vitro ability to antagonise the binding of [125I]-ET-1 to the rat aortic A10 cell membrane endothelin A receptor.
In DepthDetails ArticlePubMed