BDBM50085858 (2-Chloro-phenyl)-[2-cyano-5-(pyridazin-4-ylmethoxy)-phenoxy]-acetic acid::CHEMBL423608
SMILES OC(=O)C(Oc1cc(OCc2ccnnc2)ccc1C#N)c1ccccc1Cl
InChI Key InChIKey=OOQCRFOBRIDXEP-UHFFFAOYSA-N
Data  1 IC50
  Tab Delimited (TSV)   2D SDfile   Computed 3D by Vconf -m prep SDfile
Find this compound or compounds like it in BindingDB:
Activity Spreadsheet -- Enzyme Inhibition Constant Data from BindingDB
Found 1 hit for monomerid = 50085858
TargetEndothelin-1 receptor(RAT)
RhôNe-Poulenc Rorer
Curated by ChEMBL
LigandPNGBDBM50085858((2-Chloro-phenyl)-[2-cyano-5-(pyridazin-4-ylmethox...)
Affinity DataIC50:  44nM. Assay description: In vitro ability to antagonise the binding of [125I]-ET-1 to the rat aortic A10 cell membrane endothelin A receptor.
In DepthDetails ArticlePubMed