BDBM50085863 (3-Chloro-phenyl)-[2-cyano-5-(thiophen-3-ylmethoxy)-phenoxy]-acetic acid (0.5C4H10O)::CHEMBL171446
SMILES OC(=O)C(Oc1cc(OCc2ccsc2)ccc1C#N)c1cccc(Cl)c1
InChI Key InChIKey=XJTALNZSMSUPEU-UHFFFAOYSA-N
Data  1 IC50
  Tab Delimited (TSV)   2D SDfile   Computed 3D by Vconf -m prep SDfile
Find this compound or compounds like it in BindingDB:
Activity Spreadsheet -- Enzyme Inhibition Constant Data from BindingDB
Found 1 hit for monomerid = 50085863
TargetEndothelin-1 receptor(RAT)
RhôNe-Poulenc Rorer
Curated by ChEMBL
LigandPNGBDBM50085863((3-Chloro-phenyl)-[2-cyano-5-(thiophen-3-ylmethoxy...)
Affinity DataIC50:  98nM. Assay description: In vitro ability to antagonise the binding of [125I]-ET-1 to the rat aortic A10 cell membrane endothelin A receptor.
In DepthDetails ArticlePubMed