BDBM50087481 9-Methoxy-3-[2-(6-methoxy-1,3,3a,4,5,9b-hexahydro-benzo[e]isoindol-2-yl)-ethyl]-1H-benzo[4,5]thieno[3,2-d]pyrimidine-2,4-dione::CHEMBL41344
SMILES COc1cccc2[C@@H]3CN(CCn4c(=O)[nH]c5c(sc6cccc(OC)c56)c4=O)C[C@@H]3CCc12
InChI Key InChIKey=VDWLXTZJSKQKLN-MAUKXSAKSA-N
Data  3 KI
  Tab Delimited (TSV)   2D SDfile   Computed 3D by Vconf -m prep SDfile
Find this compound or compounds like it in BindingDB:
Activity Spreadsheet -- Enzyme Inhibition Constant Data from BindingDB
Found 3 hits for monomerid = 50087481
TargetAlpha-1A adrenergic receptor(Rattus norvegicus (Rat))
Abbott Laboratories
Curated by ChEMBL
LigandPNGBDBM50087481(9-Methoxy-3-[2-(6-methoxy-1,3,3a,4,5,9b-hexahydro-...)
Affinity DataKi:  0.770nM. Assay description: In vitro binding affinity using [3H]-prazosin as radioligand against alpha-1A adrenergic receptor
In DepthDetails ArticlePubMed
TargetAlpha-1D adrenergic receptor(Rattus norvegicus (Rat))
Abbott Laboratories
Curated by ChEMBL
LigandPNGBDBM50087481(9-Methoxy-3-[2-(6-methoxy-1,3,3a,4,5,9b-hexahydro-...)
Affinity DataKi:  1.07nM. Assay description: In vitro binding affinity using [3H]-prazosin as radioligand against alpha-1D adrenergic receptor expressed in LTK cell
In DepthDetails ArticlePubMed
TargetAlpha-1B adrenergic receptor(C.H.O.)
Abbott Laboratories
Curated by ChEMBL
LigandPNGBDBM50087481(9-Methoxy-3-[2-(6-methoxy-1,3,3a,4,5,9b-hexahydro-...)
Affinity DataKi:  3.10nM. Assay description: In vitro binding affinity using [3H]-prazosin as radioligand against alpha-1B adrenergic receptor expressed in LTK cell
In DepthDetails ArticlePubMed