BDBM50087489 8-Methoxy-2-[2-(6-methoxy-1,3,3a,4,5,9b-hexahydro-benzo[e]isoindol-2-yl)-ethyl]-4H-9-thia-2,4,5-triaza-fluorene-1,3-dione::CHEMBL287928
SMILES COc1cccc2[C@@H]3CN(CCn4c(=O)[nH]c5c6nccc(OC)c6sc5c4=O)C[C@@H]3CCc12
InChI Key InChIKey=ZAUUICAVAPQWTA-WMLDXEAASA-N
Data  3 KI
  Tab Delimited (TSV)   2D SDfile   Computed 3D by Vconf -m prep SDfile
Find this compound or compounds like it in BindingDB:
Activity Spreadsheet -- Enzyme Inhibition Constant Data from BindingDB
Found 3 hits for monomerid = 50087489
TargetAlpha-1A adrenergic receptor(Rattus norvegicus (Rat))
Abbott Laboratories
Curated by ChEMBL
LigandPNGBDBM50087489(8-Methoxy-2-[2-(6-methoxy-1,3,3a,4,5,9b-hexahydro-...)
Affinity DataKi:  0.790nM. Assay description: In vitro binding affinity using [3H]-prazosin as radioligand against alpha-1A adrenergic receptor
In DepthDetails ArticlePubMed
TargetAlpha-1D adrenergic receptor(Rattus norvegicus (Rat))
Abbott Laboratories
Curated by ChEMBL
LigandPNGBDBM50087489(8-Methoxy-2-[2-(6-methoxy-1,3,3a,4,5,9b-hexahydro-...)
Affinity DataKi:  1.41nM. Assay description: In vitro binding affinity using [3H]-prazosin as radioligand against alpha-1D adrenergic receptor expressed in LTK cell
In DepthDetails ArticlePubMed
TargetAlpha-1B adrenergic receptor(C.H.O.)
Abbott Laboratories
Curated by ChEMBL
LigandPNGBDBM50087489(8-Methoxy-2-[2-(6-methoxy-1,3,3a,4,5,9b-hexahydro-...)
Affinity DataKi:  6.69nM. Assay description: In vitro binding affinity using [3H]-prazosin as radioligand against alpha-1B adrenergic receptor expressed in LTK cell
In DepthDetails ArticlePubMed