BDBM50087847 CHEMBL413030::c[Asp9, Lys12,] [Lys17,18, Glu21]-glucagan-NH2
SMILES CSCC[C@H](NC(=O)[C@H](CC(C)C)NC(=O)[C@H](Cc1c[nH]c2ccccc12)NC(=O)[C@H](CCC(N)=O)NC(=O)[C@@H](NC(=O)[C@@H](Cc1ccccc1)NC(=O)[C@@H]1CCC(=O)NCCCC[C@H](NC(=O)[C@H](CO)NC(=O)[C@@H](CC(O)=O)NC(=O)[C@@H](CC(C)C)NC(=O)[C@H](Cc2ccc(O)cc2)NC(=O)[C@H]2CCCCNC(=O)C[C@H](NC(=O)[C@H](CO)NC(=O)[C@H](NC(=O)[C@@H](Cc3ccccc3)NC(=O)[C@H](NC(=O)CNC(=O)[C@@H](CCC(N)=O)NC(=O)[C@@H](CO)NC(=O)[C@H](N)Cc3cnc[nH]3)[C@H](C)O)[C@H](C)O)C(=O)N[C@@H](Cc3ccc(O)cc3)C(=O)N[C@H](CO)C(=O)N2)C(=O)N[C@@H](CCCCN)C(=O)N[C@H](C)C(=O)N[C@@H](CCC(N)=O)C(=O)N1)C(C)C)C(=O)N[C@@H](CC(N)=O)C(=O)N[C@@H]([C@@H](C)O)C(N)=O
InChI Key InChIKey=DGOQGSLDPQHXGU-MKSZPKPVSA-N
Data  1 IC50
  Tab Delimited (TSV)   2D SDfile   Computed 3D by Vconf -m prep SDfile
Find this compound or compounds like it in BindingDB:
Activity Spreadsheet -- Enzyme Inhibition Constant Data from BindingDB
Found 1 hit for monomerid = 50087847
TargetGlucagon receptor(Rattus norvegicus)
University Of Arizona
Curated by ChEMBL
LigandPNGBDBM50087847(CHEMBL413030 | c[Asp9, Lys12,] [Lys17,18, Glu21]-g...)
Affinity DataIC50:  250nM. Assay description: In vitro receptor binding affinity (95% CL) using rat liver plasma membrane bioassay
In DepthDetails ArticlePubMed