BDBM50088530 CHEMBL3576944::US10189805, Compound 20
SMILES CN1CCN(Cc2ccccc2CNC(=O)CC[C@H](N)C(O)=O)CC1
InChI Key InChIKey=GHRCEZHGPLGNMG-INIZCTEOSA-N
Data  2 IC50
  Tab Delimited (TSV)   2D SDfile   Computed 3D by Vconf -m prep SDfile
Find this compound or compounds like it in BindingDB:
Activity Spreadsheet -- Enzyme Inhibition Constant Data from BindingDB
Found 2 hits for monomerid = 50088530
TargetNeutral amino acid transporter B(0)(Homo sapiens (Human))
Vanderbilt University
US Patent
LigandPNGBDBM50088530(CHEMBL3576944 | US10189805, Compound 20)
Affinity DataIC50:  6.97E+5nM. Assay description: The glutamine uptake assays in HEK293 cells were carried out in 96 well plates (CulturPlate-96, Perkin Elmer). Cells were plated at a density of 35,0...
In DepthDetails US Patent
TargetNeutral amino acid transporter B(0)(Homo sapiens (Human))
Vanderbilt University
US Patent
LigandPNGBDBM50088530(CHEMBL3576944 | US10189805, Compound 20)
Affinity DataIC50:  6.97E+5nM. Assay description: Inhibition of ASCT2-mediated [3H]glutamine uptake in HEK293 cells after 15 mins by Live-cell glutamine uptake assay
In DepthDetails ArticlePubMed