BDBM50089154 4-[[((Z)-8-But-2-enyl)-8-aza-bicyclo[3.2.1]oct-3-yl]-(3-methoxy-phenyl)-amino]-N,N-diethyl-benzamide::CHEMBL280698
SMILES CCN(CC)C(=O)c1ccc(cc1)N(C1CC2CCC(C1)N2C\C=C/C)c1cccc(OC)c1
InChI Key InChIKey=CWRZZSIAXKCNKX-YVMONPNESA-N
Data  3 KI
  Tab Delimited (TSV)   2D SDfile   Computed 3D by Vconf -m prep SDfile
Find this compound or compounds like it in BindingDB:
Activity Spreadsheet -- Enzyme Inhibition Constant Data from BindingDB
Found 3 hits for monomerid = 50089154
TargetDelta-type opioid receptor(Rattus norvegicus (rat))
Research Triangle Institute
Curated by ChEMBL
LigandPNGBDBM50089154(4-[[((Z)-8-But-2-enyl)-8-aza-bicyclo[3.2.1]oct-3-y...)
Affinity DataKi:  3.70nM. Assay description: Compound was evaluated for binding affinity towards Opioid receptor delta 1 by displacement of [3H]-DADLE radioligand
In DepthDetails ArticlePubMed
TargetKappa-type opioid receptor(Cavia porcellus (domestic guinea pig))
Research Triangle Institute
Curated by ChEMBL
LigandPNGBDBM50089154(4-[[((Z)-8-But-2-enyl)-8-aza-bicyclo[3.2.1]oct-3-y...)
Affinity DataKi:  1.17E+3nM. Assay description: Compound was evaluated for binding affinity towards Opioid receptor kappa 1 by displacement of [3H]-U-69,593 radioligand
In DepthDetails ArticlePubMed
TargetMu-type opioid receptor(Rattus norvegicus (rat))
Research Triangle Institute
Curated by ChEMBL
LigandPNGBDBM50089154(4-[[((Z)-8-But-2-enyl)-8-aza-bicyclo[3.2.1]oct-3-y...)
Affinity DataKi: >3.40E+3nM. Assay description: Compound was evaluated for binding affinity towards Opioid receptor mu 1 by displacement of [3H]-DAMGO radioligand
In DepthDetails ArticlePubMed