BDBM50089307 CHEMBL410579::H-Lys-Lys-Arg-Pro-Hyp-Gly-Igl-Ser-D-BT-OH(JMV1639)
SMILES NCCCCC(N)C(=O)NC(CCCCN)C(=O)N[C@H](CCCNC(N)=N)C(=O)N1CCC[C@H]1C(=O)N1CC(O)C[C@H]1C(=O)NCC(=O)NC(C1Cc2ccccc2C1)C(=O)N[C@@H](CO)C(=O)N[C@@H]1CSc2ccccc2N(CC(O)=O)C1=O
InChI Key InChIKey=PWPVANGLZUNDSV-RBYPVDDGSA-N
Data  2 KI
  Tab Delimited (TSV)   2D SDfile   Computed 3D by Vconf -m prep SDfile
Find this compound or compounds like it in BindingDB:
Activity Spreadsheet -- Enzyme Inhibition Constant Data from BindingDB
Found 2 hits for monomerid = 50089307
TargetB1 bradykinin receptor(Homo sapiens (Human))
University Of Montpellier
Curated by ChEMBL
LigandPNGBDBM50089307(CHEMBL410579 | H-Lys-Lys-Arg-Pro-Hyp-Gly-Igl-Ser-D...)
Affinity DataKi:  0.0350nM. Assay description: Ability to bind to human cloned B1 receptor in competition binding experiments with [3H][des-Arg10,Leu9]-Kallidin.
In DepthDetails ArticlePubMed
TargetB2 bradykinin receptor(Homo sapiens (Human))
University Of Montpellier
Curated by ChEMBL
LigandPNGBDBM50089307(CHEMBL410579 | H-Lys-Lys-Arg-Pro-Hyp-Gly-Igl-Ser-D...)
Affinity DataKi:  62nM. Assay description: Ability to bind to human cloned B2 receptor in competition binding experiments with [3H]- bradykinin
In DepthDetails ArticlePubMed