BDBM50090141 7-{(1R,2R,3R,5S)-3,5-Dihydroxy-2-[(R)-3-hydroxy-5-(2-methoxy-phenyl)-pentyl]-cyclopentyl}-heptanoic acid::CHEMBL39746
SMILES COc1ccccc1CC[C@H](O)CC[C@H]1[C@H](O)C[C@H](O)[C@@H]1CCCCCCC(O)=O
InChI Key InChIKey=UKMPQZNAHCQQAM-AHJNKEMKSA-N
Data  1 IC50
  Tab Delimited (TSV)   2D SDfile   Computed 3D by Vconf -m prep SDfile
Find this compound or compounds like it in BindingDB:
Activity Spreadsheet -- Enzyme Inhibition Constant Data from BindingDB
Found 1 hit for monomerid = 50090141
TargetProstaglandin F2-alpha receptor(Homo sapiens (Human))
Procter & Gamble Pharmaceuticals
Curated by ChEMBL
LigandPNGBDBM50090141(7-{(1R,2R,3R,5S)-3,5-Dihydroxy-2-[(R)-3-hydroxy-5-...)
Affinity DataIC50:  5.89E+3nM. Assay description: Displacement of [3H]-PGF-2 from human FP-receptor expressed in CHO-KI cells
In DepthDetails ArticlePubMed