BDBM50090339 (R)-4-(3,4-Difluoro-phenyl)-2-methyl-6-oxo-1,4,5,6-tetrahydro-pyridine-3-carboxylic acid {3-[4-(2-cyano-4-fluoro-phenyl)-piperidin-1-yl]-propyl}-amide::CHEMBL43491
SMILES CC1=C([C@H](CC(=O)N1)c1ccc(F)c(F)c1)C(=O)NCCCN1CCC(CC1)c1ccc(F)cc1C#N
InChI Key InChIKey=RQTZTSPFFYDZKA-HSZRJFAPSA-N
Data  7 KI
  Tab Delimited (TSV)   2D SDfile   Computed 3D by Vconf -m prep SDfile
Find this compound or compounds like it in BindingDB:
Activity Spreadsheet -- Enzyme Inhibition Constant Data from BindingDB
Found 7 hits for monomerid = 50090339
TargetAlpha-1A adrenergic receptor(Homo sapiens (Human))
Merck
Curated by ChEMBL
LigandPNGBDBM50090339((R)-4-(3,4-Difluoro-phenyl)-2-methyl-6-oxo-1,4,5,6...)
Affinity DataKi:  0.200nM. Assay description: In vitro antagonism at Alpha-1A adrenergic receptor
In DepthDetails ArticlePubMed
TargetHistamine H1 receptor(Homo sapiens (Human))
Merck
Curated by ChEMBL
LigandPNGBDBM50090339((R)-4-(3,4-Difluoro-phenyl)-2-methyl-6-oxo-1,4,5,6...)
Affinity DataKi:  58nM. Assay description: Selectivity screen against human Histamine H1 receptor
In DepthDetails ArticlePubMed
TargetAlpha-1B adrenergic receptor(Homo sapiens (Human))
Merck
Curated by ChEMBL
LigandPNGBDBM50090339((R)-4-(3,4-Difluoro-phenyl)-2-methyl-6-oxo-1,4,5,6...)
Affinity DataKi:  100nM. Assay description: In vitro antagonism at Alpha-1B adrenergic receptor
In DepthDetails ArticlePubMed
TargetAlpha-2B adrenergic receptor(Homo sapiens (Human))
Merck
Curated by ChEMBL
LigandPNGBDBM50090339((R)-4-(3,4-Difluoro-phenyl)-2-methyl-6-oxo-1,4,5,6...)
Affinity DataKi:  145nM. Assay description: In vivo inhibitory effect of the compound against alpha-2b Adrenergic receptor
In DepthDetails ArticlePubMed
TargetAlpha-1D adrenergic receptor(Homo sapiens (Human))
Merck
Curated by ChEMBL
LigandPNGBDBM50090339((R)-4-(3,4-Difluoro-phenyl)-2-methyl-6-oxo-1,4,5,6...)
Affinity DataKi:  150nM. Assay description: In vitro antagonism at Alpha-1D adrenergic receptor
In DepthDetails ArticlePubMed
TargetAlpha-2A adrenergic receptor(Homo sapiens (Human))
Merck
Curated by ChEMBL
LigandPNGBDBM50090339((R)-4-(3,4-Difluoro-phenyl)-2-methyl-6-oxo-1,4,5,6...)
Affinity DataKi:  1.29E+3nM. Assay description: In vivo inhibitory effect against Alpha-2A adrenergic receptor
In DepthDetails ArticlePubMed
TargetAlpha-2C adrenergic receptor(Homo sapiens (Human))
Merck
Curated by ChEMBL
LigandPNGBDBM50090339((R)-4-(3,4-Difluoro-phenyl)-2-methyl-6-oxo-1,4,5,6...)
Affinity DataKi:  1.48E+3nM. Assay description: In vivo inhibitory effect of the compound against Alpha-2C adrenergic receptor
In DepthDetails ArticlePubMed