BDBM50091675 CHEMBL412378::N-alpha-Ac-[Bip27]PYY(22-36)-NH2
SMILES CC(C)C[C@H](NC(=O)[C@H](CO)NC(=O)[C@H](C)NC(C)=O)C(=O)N[C@@H](CCCNC(N)=N)C(=O)N[C@@H](Cc1cnc[nH]1)C(=O)N[C@@H](Cc1ccc(cc1)-c1ccccc1)C(=O)N[C@@H](CC(C)C)C(=O)N[C@@H](CC(N)=O)C(=O)N[C@@H](CC(C)C)C(=O)N[C@@H](C(C)C)C(=O)N[C@@H]([C@@H](C)O)C(=O)N[C@@H](CCCNC(N)=N)C(=O)N[C@@H](CCC(N)=O)C(=O)N[C@@H](CCCNC(N)=N)C(=O)N[C@@H](Cc1ccc(O)cc1)C(N)=O
InChI Key InChIKey=YGZNABCWVGUOOF-IETSUNRESA-N
Data  3 IC50
  Tab Delimited (TSV)   2D SDfile   Computed 3D by Vconf -m prep SDfile
Find this compound or compounds like it in BindingDB:
Activity Spreadsheet -- Enzyme Inhibition Constant Data from BindingDB
Found 3 hits for monomerid = 50091675
TargetNeuropeptide Y receptor type 2(RAT)
University Of Cincinnati Medical Center
Curated by ChEMBL
LigandPNGBDBM50091675(CHEMBL412378 | N-alpha-Ac-[Bip27]PYY(22-36)-NH2)
Affinity DataIC50:  2.42nM. Assay description: Tested for the affinity for intestinal PYY from rat jejunum by using short circuit current (SCC) method.
In DepthDetails ArticlePubMed
TargetNeuropeptide Y receptor type 1(Homo sapiens (Human))
University Of Cincinnati Medical Center
Curated by ChEMBL
LigandPNGBDBM50091675(CHEMBL412378 | N-alpha-Ac-[Bip27]PYY(22-36)-NH2)
Affinity DataIC50:  279nM. Assay description: Affinity against Neuropeptide Y receptor Y1 in SK-N-MC cell line
In DepthDetails ArticlePubMed
TargetNeuropeptide Y receptor type 2(Homo sapiens (Human))
University Of Cincinnati Medical Center
Curated by ChEMBL
LigandPNGBDBM50091675(CHEMBL412378 | N-alpha-Ac-[Bip27]PYY(22-36)-NH2)
Affinity DataIC50:  14.2nM. Assay description: Affinity against Neuropeptide Y receptor Y2 in SK-N-BE2 cell line
In DepthDetails ArticlePubMed