BDBM50091740 (S)-3-{2-[(R)-2-Oxo-3-(2-piperidin-4-yl-ethyl)-piperidin-1-yl]-acetylamino}-pent-4-ynoic acid::CHEMBL292663
SMILES OC(=O)C[C@H](NC(=O)CN1CCC[C@@H](CCC2CCNCC2)C1=O)C#C
InChI Key InChIKey=KTHYBTKKKGIYPR-JKSUJKDBSA-N
Data  1 IC50  2 Kd
  Tab Delimited (TSV)   2D SDfile   Computed 3D by Vconf -m prep SDfile
Find this compound or compounds like it in BindingDB:
Activity Spreadsheet -- Enzyme Inhibition Constant Data from BindingDB
Found 3 hits for monomerid = 50091740
TargetIntegrin alpha-IIb/beta-3(Homo sapiens (Human))
Merck Research Laboratories
Curated by ChEMBL
LigandPNGBDBM50091740((S)-3-{2-[(R)-2-Oxo-3-(2-piperidin-4-yl-ethyl)-pip...)
Affinity DataKd:  210nM. Assay description: Binding affinity to resting form of alpha IIb/beta3 integrin by flow cytometry using fluorescein ligand L-726,745 displacement from human platelets.
In DepthDetails ArticlePubMed
TargetIntegrin alpha-IIb/beta-3(Homo sapiens (Human))
Merck Research Laboratories
Curated by ChEMBL
LigandPNGBDBM50091740((S)-3-{2-[(R)-2-Oxo-3-(2-piperidin-4-yl-ethyl)-pip...)
Affinity DataKd:  0.860nM. Assay description: Inhibition of aggregation of human gel-filtered platelets measured by light transmittance method at 37 degrees C.
In DepthDetails ArticlePubMed
TargetIntegrin alpha-IIb/beta-3(Homo sapiens (Human))
Merck Research Laboratories
Curated by ChEMBL
LigandPNGBDBM50091740((S)-3-{2-[(R)-2-Oxo-3-(2-piperidin-4-yl-ethyl)-pip...)
Affinity DataIC50:  13nM. Assay description: Inhibition of aggregation of human gel-filtered platelets measured by light transmittance method at 37 degrees C.
In DepthDetails ArticlePubMed